Target
Tyrosine-protein kinase ABL1 [64-515]
Ligand
BDBM230766
Substrate
Meas. Tech.
Caliper Assay
pH
7.5±n/a
Temperature
303.15±n/a K
IC50
5±n/a nM
Comments
extracted
Citation
 Furet, PGrotzfeld, RMJahnke, WJones, DBManley, PWMarzinzik, APelle, XFSalem, BSchoepfer, J Benzamide derivatives for inhibiting the activity of ABL1, ABL2 and BCR-ABL1 US Patent  US9340537 Publication Date 5/17/2016 
Target
Name:
Tyrosine-protein kinase ABL1 [64-515]
Synonyms:
ABL ABL1_HUMAN Tyrosine-protein kinase ABL1 Tyrosine-protein kinase ABL1 (ABL) | Tyrosine-protein kinase ABL1 (ABL1)
Type:
Enzyme Catalytic Domain
Mol. Mass.:
51539.77
Organism:
Homo sapiens (Human)
Description:
aa 64-515
Residue:
452
  
Inhibitor
Name:
BDBM230766
Synonyms:
US9340537, 20 | US9896444, Example 20
Type:
Small organic molecule
Emp. Form.:
C20H18F3N3O3S
Mol. Mass.:
437.435
SMILES:
CN(CCO)c1ccc(cc1-c1cncs1)C(=O)Nc1ccc(OC(F)(F)F)cc1
: