Target
Beta-secretase 1
Ligand
BDBM230874
Substrate
Meas. Tech.
BACE1 Binding Assay
pH
4.5±n/a
Temperature
298.15±n/a K
Ki
16±n/a nM
Comments
extracted
Citation
 Juhl, KTagmose, LMarigo, M 2-amino 6-(difluoromethyl)-5,5-difluoro-6-phenyl-3,4,5,6-tetrahydropyridines as BACE1 inhibitors US Patent  US9346797 Publication Date 5/24/2016 
Target
Name:
Beta-secretase 1
Synonyms:
ASP2 Aspartyl protease 2 BACE1 Beta-secretase (BACE) Beta-secretase 1 (BACE 1) Beta-secretase 1 (BACE1) Beta-site amyloid precursor protein cleaving enzyme 1 Memapsin-2 beta-Secretase (BACE-1) | beta-Secretase (BACE1)
Type:
Protein
Mol. Mass.:
55755.10
Organism:
Homo sapiens (Human)
Description:
P56817
Residue:
501
  
Inhibitor
Name:
BDBM230874
Synonyms:
US10045974, 10 US9346797, 10
Type:
Small organic molecule
Emp. Form.:
C19H18F5N5O2
Mol. Mass.:
443.3705
SMILES:
COc1cnc(C(=O)Nc2ccc(F)c(c2)[C@]2(N=C(N)CCC2(F)F)C(F)F)c(C)n1
: