Target
Beta-secretase 1
Ligand
BDBM230876
Substrate
Meas. Tech.
BACE1 Binding Assay
pH
4.5±n/a
Temperature
298.15±n/a K
Ki
6.1±n/a nM
Comments
extracted
Citation
 Juhl, KTagmose, LMarigo, M 2-amino 6-(difluoromethyl)-5,5-difluoro-6-phenyl-3,4,5,6-tetrahydropyridines as BACE1 inhibitors US Patent  US9346797 Publication Date 5/24/2016 
Target
Name:
Beta-secretase 1
Synonyms:
ASP2 Aspartyl protease 2 BACE1 Beta-secretase (BACE) Beta-secretase 1 (BACE 1) Beta-secretase 1 (BACE1) Beta-site amyloid precursor protein cleaving enzyme 1 Memapsin-2 beta-Secretase (BACE-1) | beta-Secretase (BACE1)
Type:
Protein
Mol. Mass.:
55755.10
Organism:
Homo sapiens (Human)
Description:
P56817
Residue:
501
  
Inhibitor
Name:
BDBM230876
Synonyms:
US10045974, 12 US9346797, 12
Type:
Small organic molecule
Emp. Form.:
C18H14BrF5N4O
Mol. Mass.:
477.226
SMILES:
NC1=N[C@](C(F)F)(c2cc(NC(=O)c3ccc(Br)cn3)ccc2F)C(F)(F)CC1
: