Target
Gonadotropin-releasing hormone receptor
Ligand
BDBM230879
Substrate
Meas. Tech.
125I-Leuprorelin Binding Assay
IC50
0.1±n/a nM
Citation
 Cho, NImada, THitaka, TMiwa, KKusaka, MSuzuki, N Thienopyrimidine compounds and use thereof US Patent  US9346822 Publication Date 5/24/2016 
Target
Name:
Gonadotropin-releasing hormone receptor
Synonyms:
GNRHR GRHR GnRH-R Gonadotropin-releasing hormone receptor | Gonadotropin-releasing hormone receptor (GnRH)
Type:
Enzyme
Mol. Mass.:
37749.45
Organism:
Homo sapiens (Human)
Description:
P30968
Residue:
328
  
Inhibitor
Name:
BDBM230879
Synonyms:
US9346822, 41
Type:
Small organic molecule
Emp. Form.:
C32H32F2N6O5S
Mol. Mass.:
650.695
SMILES:
CCOCCN(C)Cc1c(sc2n(Cc3c(F)cccc3F)c(=O)n(-c3ccccn3)c(=O)c12)-c1ccc(NC(=O)NOC)cc1
: