Target
ALK tyrosine kinase receptor
Ligand
BDBM291931
Substrate
Meas. Tech.
Inhibition of ALK WT Anaplastic Lymphoma Kinase Activity
Temperature
298.15±n/a K
IC50
2800±n/a nM
Comments
extracted
Citation
 Kim, PKim, HRCho, SYHa, JDJung, HJYun, CSHwang, JYPark, CHLee, COAhn, SChae, CH N2-(2-methoxyphenyl)pyrimidine derivative, method for preparing same, and pharmaceutical composition for cancer prevention or treatment containing same as active ingredient US Patent  US10100019 Publication Date 10/16/2018 
Target
Name:
ALK tyrosine kinase receptor
Synonyms:
ALK ALK_HUMAN CD_antigen: CD246
Type:
Protein
Mol. Mass.:
176453.10
Organism:
Homo sapiens (Human)
Description:
Q9UM73
Residue:
1620
  
Inhibitor
Name:
BDBM291931
Synonyms:
US10100019, Example 1
Type:
Small organic molecule
Emp. Form.:
C26H32ClN5O3S
Mol. Mass.:
530.082
SMILES:
COc1ccc(cc1Nc1ncc(Cl)c(Nc2ccccc2S(=O)(=O)C(C)C)n1)C1(CN)CCCC1
: