Target
Insulin receptor
Ligand
BDBM291953
Substrate
Meas. Tech.
Inhibition of ALK IR Anaplastic Lymphoma Kinase Activity
IC50
120±n/a nM
Citation
 Kim, PKim, HRCho, SYHa, JDJung, HJYun, CSHwang, JYPark, CHLee, COAhn, SChae, CH N2-(2-methoxyphenyl)pyrimidine derivative, method for preparing same, and pharmaceutical composition for cancer prevention or treatment containing same as active ingredient US Patent  US10100019 Publication Date 10/16/2018 
Target
Name:
Insulin receptor
Synonyms:
INSR INSR_HUMAN Insulin receptor beta subunit
Type:
Receptor Tyrosine Kinase
Mol. Mass.:
156322.60
Organism:
Homo sapiens (Human)
Description:
P06213
Residue:
1382
  
Inhibitor
Name:
BDBM291953
Synonyms:
US10100019, Example 23
Type:
Small organic molecule
Emp. Form.:
C25H31ClN6O3S2
Mol. Mass.:
563.135
SMILES:
CCNC(=S)NCCc1ccc(OC)c(Nc2ncc(Cl)c(Nc3ccccc3S(=O)(=O)C(C)C)n2)c1
: