Target
Poly [ADP-ribose] polymerase tankyrase-1 [1091-1325]
Ligand
BDBM231011
Substrate
Meas. Tech.
Tankyrase Biochemical Assays
Temperature
298.15±n/a K
IC50
323±n/a nM
Comments
extracted
Citation
 Bregman, HBuchanan, JLChakka, NDimauro, EFGunaydin, HGuzman-Perez, AHua, ZHuang, HHuang, XMartin, MWPatel, VF Oxazolidinone compounds and derivatives thereof US Patent  US9340549 Publication Date 5/17/2016 
Target
Name:
Poly [ADP-ribose] polymerase tankyrase-1 [1091-1325]
Synonyms:
PARP5A TIN1 TNKS TNKS1_HUMAN | Tankyrase-1
Type:
Enzyme
Mol. Mass.:
26714.90
Organism:
Homo sapiens (Human)
Description:
O95271[1091-1325]
Residue:
235
  
Inhibitor
Name:
BDBM231011
Synonyms:
US9340549, 28
Type:
Small organic molecule
Emp. Form.:
C27H29N3O3
Mol. Mass.:
443.5375
SMILES:
CC1(C)OC(=O)N([C@@H]1c1ccccc1)[C@H]1CC[C@@H](CC1)NC(=O)c1cccc2cccnc12
: