Target
Poly [ADP-ribose] polymerase tankyrase-1 [1091-1325]
Ligand
BDBM231118
Substrate
Meas. Tech.
Tankyrase Biochemical Assays
Temperature
298.15±n/a K
IC50
225±n/a nM
Comments
extracted
Citation
 Bregman, HBuchanan, JLChakka, NDimauro, EFGunaydin, HGuzman-Perez, AHua, ZHuang, HHuang, XMartin, MWPatel, VF Oxazolidinone compounds and derivatives thereof US Patent  US9340549 Publication Date 5/17/2016 
Target
Name:
Poly [ADP-ribose] polymerase tankyrase-1 [1091-1325]
Synonyms:
PARP5A TIN1 TNKS TNKS1_HUMAN | Tankyrase-1
Type:
Enzyme
Mol. Mass.:
26714.90
Organism:
Homo sapiens (Human)
Description:
O95271[1091-1325]
Residue:
235
  
Inhibitor
Name:
BDBM231118
Synonyms:
US9340549, 143
Type:
Small organic molecule
Emp. Form.:
C27H31N3O3
Mol. Mass.:
445.5533
SMILES:
Cn1cc(C(=O)N[C@H]2CC[C@@H](CC2)N2[C@@H](c3ccccc3)C(C)(C)OC2=O)c2ccccc12
: