Target
Poly [ADP-ribose] polymerase tankyrase-2 [946-1162]
Ligand
BDBM230986
Substrate
Meas. Tech.
Tankyrase Biochemical Assays
Temperature
298.15±n/a K
IC50
65.9±n/a nM
Comments
extracted
Citation
 Bregman, HBuchanan, JLChakka, NDimauro, EFGunaydin, HGuzman-Perez, AHua, ZHuang, HHuang, XMartin, MWPatel, VF Oxazolidinone compounds and derivatives thereof US Patent  US9340549 Publication Date 5/17/2016 
Target
Name:
Poly [ADP-ribose] polymerase tankyrase-2 [946-1162]
Synonyms:
PARP5B TNKL TNKS2_HUMAN | Tankyrase-2
Type:
Enzyme
Mol. Mass.:
24581.05
Organism:
Homo sapiens (Human)
Description:
aa 946-1162
Residue:
217
  
Inhibitor
Name:
BDBM230986
Synonyms:
US9340549, 4
Type:
Small organic molecule
Emp. Form.:
C26H22N4O3
Mol. Mass.:
438.4779
SMILES:
CC1(C)OC(=O)N([C@H]1c1ccccc1)c1ccc(cc1)-c1cc(c[nH]c1=O)-c1ncccn1
: