Target
Tyrosine-protein phosphatase non-receptor type 4
Ligand
BDBM231167
Substrate
Meas. Tech.
Enzyme Kinetic Assay
pH
7±n/a
IC50
>10000±n/a nM
Comments
extracted
Citation
 Zhang, ZZhang, S Inhibitors of protein tyrosine phosphatases US Patent  US9340574 Publication Date 5/17/2016 
Target
Name:
Tyrosine-protein phosphatase non-receptor type 4
Synonyms:
Megakaryocyte protein-tyrosine phosphatase (PTP-MEG2) PTPN4 Tyrosine-protein phosphatase non-receptor type 4 (PTP-MEG1)
Type:
Protein
Mol. Mass.:
105923.44
Organism:
Homo sapiens (Human)
Description:
Residue:
926
  
Inhibitor
Name:
BDBM231167
Synonyms:
US9340574, 7
Type:
Small organic molecule
Emp. Form.:
C42H45BrF2IN6O11P
Mol. Mass.:
1085.619
SMILES:
COc1cc(CC(=O)NCC(NC(=O)C(CCCNC(=O)c2cccc(I)c2)NC(=O)C(Cc2ccc(cc2)C(F)(F)P(O)(O)=O)NC(=O)c2ccc(C)c(Br)c2)C(N)=O)ccc1O
: