Target
Induced myeloid leukemia cell differentiation protein Mcl-1
Ligand
BDBM231592
Substrate
Meas. Tech.
Biotin Assay
IC50
1000±n/a nM
Citation
 Cardone, MHKolodziej, AFRichard, D Compositions and methods useful for treating diseases US Patent  US9345700 Publication Date 5/24/2016 
Target
Name:
Induced myeloid leukemia cell differentiation protein Mcl-1
Synonyms:
BCL2L3 Bcl-2-like protein 3 (Mcl-1) Bcl2-L-3 MCL1 Mcl-1 Myeloid cell leukemia sequence 1 (BCL2-related) | mcl1/EAT
Type:
Membrane; Single-pass membrane protein
Mol. Mass.:
37332.87
Organism:
Homo sapiens (Human)
Description:
Q07820
Residue:
350
  
Inhibitor
Name:
BDBM231592
Synonyms:
US9345700, 27
Type:
Small organic molecule
Emp. Form.:
C27H23N5O2
Mol. Mass.:
449.5038
SMILES:
O=C(Nc1cccnc1)c1cc(nc2ccc(NCCNc3ccccc3)cc12)-c1ccco1
: