Target
Induced myeloid leukemia cell differentiation protein Mcl-1
Ligand
BDBM231610
Substrate
Meas. Tech.
Biotin Assay
IC50
4800±n/a nM
Citation
 Cardone, MHKolodziej, AFRichard, D Compositions and methods useful for treating diseases US Patent  US9345700 Publication Date 5/24/2016 
Target
Name:
Induced myeloid leukemia cell differentiation protein Mcl-1
Synonyms:
BCL2L3 Bcl-2-like protein 3 (Mcl-1) Bcl2-L-3 MCL1 Mcl-1 Myeloid cell leukemia sequence 1 (BCL2-related) | mcl1/EAT
Type:
Membrane; Single-pass membrane protein
Mol. Mass.:
37332.87
Organism:
Homo sapiens (Human)
Description:
Q07820
Residue:
350
  
Inhibitor
Name:
BDBM231610
Synonyms:
US9345700, 45
Type:
Small organic molecule
Emp. Form.:
C28H16N4O2S2
Mol. Mass.:
504.582
SMILES:
O=C(Nc1nc2ccccc2s1)c1cc(nc2ccc(cc12)-c1ccc2scnc2c1)-c1ccco1
: