Target
Nuclear receptor ROR-gamma [258-518,Y502F]
Ligand
BDBM231234
Substrate
Meas. Tech.
Reporter Assay
IC50
210±n/a nM
Citation
 Leonard, KABarbay, KEdwards, JPKreutter, KDKummer, DAMaharoof, UNishimura, RUrbanski, MVenkatesan, HWang, AWolin, RLWoods, CRCummings, MD Alkyl linked quinolinyl modulators of RORγt US Patent  US9346782 Publication Date 5/24/2016 
Target
Name:
Nuclear receptor ROR-gamma [258-518,Y502F]
Synonyms:
NR1F3 RORG RZRG | Retinoic acid-related nuclear receptor gamma t (RORgammat)
Type:
Enzyme
Mol. Mass.:
30130.98
Organism:
Artificial Sequence
Description:
Artificial LBD sequence mutated AF2 domain (Seq No: 9)
Residue:
261
  
Inhibitor
Name:
BDBM231234
Synonyms:
US9346782, 14a US9346782, 14c
Type:
Small organic molecule
Emp. Form.:
C26H21ClF3N3O2
Mol. Mass.:
499.912
SMILES:
COc1nc2ccc(cc2c(Cl)c1Cc1ccc(cc1)C(F)(F)F)C(O)(C#C)c1cnc(C)n1C
: