Target
Acetylcholinesterase
Ligand
BDBM231543
Substrate
Meas. Tech.
In Vitro Pharmacodynamic Assay
IC50
>2000±n/a nM
Citation
 Bai, HZhao, XZhong, JGong, YZhu, QLiu, XZheng, XLiu, L Benzodioxole derivative and preparation method and use thereof US Patent  US9346818 Publication Date 5/24/2016 
Target
Name:
Acetylcholinesterase
Synonyms:
ACES_MOUSE Acetylcholinesterase (mouse AChE) Ache
Type:
Enzyme
Mol. Mass.:
68165.65
Organism:
Mus musculus (mouse)
Description:
Residue:
614
  
Inhibitor
Name:
BDBM231543
Synonyms:
US9346818, I-28
Type:
Small organic molecule
Emp. Form.:
C26H30N2O4
Mol. Mass.:
434.5274
SMILES:
COc1ccc(CN2CCC(CCN3C(=O)c4cc5OCOc5cc4C33CC3)CC2)cc1
: