Target
Substance-P receptor
Ligand
BDBM292012
Substrate
Meas. Tech.
BCA Protein Assay
pH
7.4±n/a
Temperature
333.15±n/a K
IC50
4.65±n/a nM
Comments
extracted
Citation
 Shimizu, KMiyagi, TOhno, KUeno, YOnda, YSuzuki, H Carboxymethyl piperidine derivative US Patent  US10100030 Publication Date 10/16/2018 
Target
Name:
Substance-P receptor
Synonyms:
NK-1 receptor NK1 Receptor NK1R_HUMAN Neurokinin-1 (NK-1) SPR TACR1 Tachykinin receptor 1 (NK1) | tachykinin
Type:
G Protein-Coupled Receptor (GPCR)
Mol. Mass.:
46254.43
Organism:
Homo sapiens (Human)
Description:
P25103
Residue:
407
  
Inhibitor
Name:
BDBM292012
Synonyms:
US10100030, Example 7
Type:
Small organic molecule
Emp. Form.:
C34H36F7N3O3
Mol. Mass.:
667.6568
SMILES:
CN(C(=O)C(C)(C)c1cc(cc(c1)C(F)(F)F)C(F)(F)F)c1cnc(cc1-c1ccc(F)cc1C)N1CCC(CC1)C(C)(C)C(O)=O
: