Target
Lysine-specific demethylase 6B
Ligand
BDBM231631
Substrate
Meas. Tech.
AlphaScreen Assay
pH
7.5±n/a
Temperature
298.15±n/a K
Kd
8e+2± 3e+2 nM
Comments
extracted
Citation
 Walport, LJHopkinson, RJVollmar, MMadden, SKGileadi, COppermann, USchofield, CJJohansson, C Human UTY(KDM6C) is a male-specific N¿-methyl lysyl demethylase. J Biol Chem 289:18302-13 (2014)  
Target
Name:
Lysine-specific demethylase 6B
Synonyms:
JMJD3 Jumonji domain-containing protein 3 KDM6B_HUMAN Lysine demethylase 6B Lysine-specific demethylase 6B (KDM6B(JMJD3)) | Lysine-specific demethylase 6B (KDM6B)
Type:
Protein
Mol. Mass.:
176672.55
Organism:
Homo sapiens (Human)
Description:
O15054
Residue:
1643
  
Inhibitor
Name:
BDBM231631
Synonyms:
Biotin-KAPRKQLATKAARKMe3SAPATGG | H3K27Me3 peptide
Type:
Small organic molecule
Emp. Form.:
C103H183N34O28S
Mol. Mass.:
2377.831
SMILES:
CC(C)C[C@H](NC(=O)[C@H](CCC(N)=O)NC(=O)[C@H](CCCCN)NC(=O)[C@H](CCCNC(N)=N)NC(=O)[C@@H]1CCCN1C(=O)[C@H](C)NC(=O)[C@H](CCCCN)NC(=O)CCCC[C@@H]1SC[C@@H]2NC(=O)N[C@H]12)C(=O)N[C@@H](C)C(=O)N[C@@H]([C@@H](C)O)C(=O)N[C@@H](CCCC[N+](C)(C)C)C(=O)N[C@@H](C)C(=O)N[C@@H](C)C(=O)N[C@@H](CCCNC(N)=N)C(=O)N[C@@H](CCCCN)C(=O)N[C@@H](CO)C(=O)N[C@@H](C)C(=O)N1CCC[C@H]1C(=O)N[C@@H](C)C(=O)N[C@@H]([C@@H](C)O)C(=O)NCC(=O)NCC(O)=O
: