Target
Olfactory receptor class A-like protein 1
Ligand
BDBM52946
Substrate
Meas. Tech.
Functional Calcium Imaging Assay
pH
7.4±n/a
EC50
2.28e+4± 2.7e+3 nM
Comments
extracted
Citation
 Behrens, MFrank, ORawel, HAhuja, GPotting, CHofmann, TMeyerhof, WKorsching, S ORA1, a zebrafish olfactory receptor ancestral to all mammalian V1R genes, recognizes 4-hydroxyphenylacetic acid, a putative reproductive pheromone. J Biol Chem 289:19778-88 (2014)  
Target
Name:
Olfactory receptor class A-like protein 1
Synonyms:
ORA1_DANRE Vlr2 | ora1
Type:
Protein
Mol. Mass.:
34536.30
Organism:
Danio rerio (Zebrafish)
Description:
Q597G5
Residue:
316
  
Inhibitor
Name:
BDBM52946
Synonyms:
2-(3,4-dihydroxyphenyl)acetic acid 3,4-Dihydroxyphenylacetate, XV MLS001056737 cid_547
Type:
Small organic molecule
Emp. Form.:
C8H8O4
Mol. Mass.:
168.1467
SMILES:
OC(=O)Cc1ccc(O)c(O)c1
: