Target
Sodium/potassium-transporting ATPase subunit alpha-1/beta-1
Ligand
BDBM231663
Substrate
Meas. Tech.
Na,K-ATPase Inhibition Assay
Ki
196±8.5 nM
Citation
 Katz, ATal, DMHeller, DHaviv, HRabah, BBarkana, YMarcovich, ALKarlish, SJ Digoxin derivatives with enhanced selectivity for the a2 isoform of Na,K-ATPase: effects on intraocular pressure in rabbits. J Biol Chem 289:21153-62 (2014)  
Target
Name:
Sodium/potassium-transporting ATPase subunit alpha-1/beta-1
Synonyms:
Na,K-ATPase α1β1 alpha1beta1FXYD1
Type:
Protein
Mol. Mass.:
Description:
Components:
This complex has 2 components.
Component 1
Name:
Sodium/potassium-transporting ATPase subunit alpha-1
Synonyms:
AT1A1_HUMAN Na(+)/K(+) ATPase alpha-1 subunit Sodium pump subunit alpha-1 | Sodium/potassium-transporting ATPase subunit alpha-1
Type:
Enzyme
Mol. Mass.:
112879.20
Organism:
Homo sapiens (Human)
Description:
P05023
Residue:
1023
  
Component 2
Name:
Sodium/potassium-transporting ATPase subunit beta-1
Synonyms:
AT1B1_HUMAN ATP1B1 | Na,K-ATPase isoform beta-1 (β1)
Type:
Enzyme
Mol. Mass.:
35067.44
Organism:
Homo sapiens (Human)
Description:
P05026
Residue:
303
  
Inhibitor
Name:
BDBM231663
Synonyms:
Dbis | Digoxigenin bis-digitoxoside
Type:
Small organic molecule
Emp. Form.:
C35H54O11
Mol. Mass.:
650.7967
SMILES:
C[C@H]1O[C@H](C[C@H](O)[C@@H]1O)O[C@H]1[C@@H](O)C[C@H](O[C@H]2CC[C@@]3(C)[C@H](CC[C@@H]4[C@@H]3C[C@@H](O)[C@]3(C)[C@H](CC[C@]43O)C3=CC(=O)OC3)C2)O[C@@H]1C
: