Target
Sodium/potassium-transporting ATPase subunit alpha-2/beta-1
Ligand
BDBM231652
Substrate
Meas. Tech.
Na,K-ATPase Inhibition Assay
Ki
128±11 nM
Citation
 Katz, ATal, DMHeller, DHaviv, HRabah, BBarkana, YMarcovich, ALKarlish, SJ Digoxin derivatives with enhanced selectivity for the a2 isoform of Na,K-ATPase: effects on intraocular pressure in rabbits. J Biol Chem 289:21153-62 (2014)  
Target
Name:
Sodium/potassium-transporting ATPase subunit alpha-2/beta-1
Synonyms:
Na,K-ATPase α2β1 alpha2beta1FXYD1
Type:
Protein
Mol. Mass.:
Description:
Components:
This complex has 2 components.
Component 1
Name:
Sodium/potassium-transporting ATPase subunit alpha-2
Synonyms:
AT1A2_HUMAN KIAA0778 | Na,K-ATPase isoform alpha-2 (α2)
Type:
Enzyme
Mol. Mass.:
112253.12
Organism:
Homo sapiens (Human)
Description:
P50993
Residue:
1020
  
Component 2
Name:
Sodium/potassium-transporting ATPase subunit beta-1
Synonyms:
AT1B1_HUMAN ATP1B1 | Na,K-ATPase isoform beta-1 (β1)
Type:
Enzyme
Mol. Mass.:
35067.44
Organism:
Homo sapiens (Human)
Description:
P05026
Residue:
303
  
Inhibitor
Name:
BDBM231652
Synonyms:
DGlMe (3)
Type:
Small organic molecule
Emp. Form.:
C44H69NO14
Mol. Mass.:
836.017
SMILES:
COC(=O)CN1CCC(O[C@H]2[C@@H](O)C[C@H](O[C@H]3[C@@H](O)C[C@H](O[C@H]4CC[C@@]5(C)C(CCC6C5C[C@H](O)[C@]5(C)[C@H](CC[C@]65O)C5=CC(=O)OC5)C4)O[C@H]3C)O[C@H]2C)OC(C)C1
: