Target
Phenylalanine--tRNA ligase alpha/beta subunit
Ligand
BDBM231677
Substrate
Meas. Tech.
Aminoacylation Assay
pH
8±n/a
IC50
1.9e+2±n/a nM
Comments
extracted
Citation
 Abibi, AFerguson, ADFleming, PRGao, NHajec, LIHu, JLaganas, VAMcKinney, DCMcLeod, SMPrince, DBShapiro, ABBuurman, ET The role of a novel auxiliary pocket in bacterial phenylalanyl-tRNA synthetase druggability. J Biol Chem 289:21651-62 (2014)  
Target
Name:
Phenylalanine--tRNA ligase alpha/beta subunit
Synonyms:
Phenylalanyl-tRNA synthetase (PheRS)
Type:
Enzyme
Mol. Mass.:
Description:
E. coli PheRS
Components:
This complex has 2 components.
Component 1
Name:
Phenylalanine--tRNA ligase alpha subunit
Synonyms:
Phenylalanyl-tRNA synthetase alpha subunit (PheRS) pheS
Type:
Enzyme
Mol. Mass.:
36828.85
Organism:
Escherichia coli (Enterobacteria)
Description:
P08312
Residue:
327
  
Component 2
Name:
Phenylalanine--tRNA ligase beta subunit
Synonyms:
Phenylalanyl-tRNA synthetase beta subunit (PheRSβ) pheT
Type:
Enzyme
Mol. Mass.:
87356.43
Organism:
Escherichia coli (Enterobacteria)
Description:
P07395
Residue:
795
  
Inhibitor
Name:
BDBM231677
Synonyms:
2-((4-Chlorophenoxy)methyl)-N-(2-sulfamoylethyl)thiazole-4-carboxamide (4c)
Type:
Small organic molecule
Emp. Form.:
C13H14ClN3O4S2
Mol. Mass.:
375.851
SMILES:
NS(=O)(=O)CCNC(=O)c1csc(COc2ccc(Cl)cc2)n1
: