Target
Heme oxygenase HutZ [D132N]
Ligand
BDBM231681
Substrate
Meas. Tech.
Heme Binding Assay
pH
6±0
Kd
1.9e+3± 3e+2 nM
Citation
 Uchida, TDojun, NSekine, YIshimori, K Heme Proximal Hydrogen Bonding between His170 and Asp132 Plays an Essential Role in the Heme Degradation Reaction of HutZ from Vibrio cholerae. Biochemistry 56:2723-2734 (2017)  
Target
Name:
Heme oxygenase HutZ [D132N]
Synonyms:
HUTZ_VIBCH hutZ
Type:
Protein
Mol. Mass.:
20294.78
Organism:
Vibrio cholerae
Description:
V. cholerae HutZ variant D132N
Residue:
176
  
Inhibitor
Name:
BDBM231681
Synonyms:
Hemin
Type:
Small organic molecule
Emp. Form.:
C34H32N4O4
Mol. Mass.:
560.6434
SMILES:
Cc1c(CCC(O)=O)c2cc3[n-]c(cc4nc(cc5[n-]c(cc1n2)c(C)c5C=C)c(C)c4C=C)c(C)c3CCC(O)=O
: