Target
Alpha-glucosidase MAL32
Ligand
BDBM231682
Substrate
Meas. Tech.
α-Glucosidase Inhibition Assay
pH
6.8±n/a
Temperature
310.15±n/a K
IC50
1.271e+4± 1 nM
Comments
extracted
Citation
 Chaudhry, FChoudhry, SHuma, RAshraf, MAl-Rashida, MMunir, RSohail, RJahan, BMunawar, MAKhan, MA Hetarylcoumarins: Synthesis and biological evaluation as potent a-glucosidase inhibitors. Bioorg Chem 73:1-9 (2017)  
Target
Name:
Alpha-glucosidase MAL32
Synonyms:
MAL32 MAL3S | alpha-Glucosidase (α-Glucosidase)
Type:
Enzyme
Mol. Mass.:
68132.36
Organism:
Saccharomyces cerevisiae (Baker's yeast)
Description:
P38158
Residue:
584
  
Inhibitor
Name:
BDBM231682
Synonyms:
3-(4-(1-(4-Chlorophenyl)-4,5-diphenyl-1H-imidazol-2-yl)-1- phenyl-1H-pyrazol-3-yl)-4a,8a-dihydro-2H-chromen-2-one (3a)
Type:
Small organic molecule
Emp. Form.:
C39H27ClN4O2
Mol. Mass.:
619.11
SMILES:
Clc1ccc(cc1)-n1c(nc(c1-c1ccccc1)-c1ccccc1)-c1cn(nc1C1=CC2C=CC=CC2OC1=O)-c1ccccc1
: