Target
Secreted cathepsin L 1
Ligand
BDBM232210
Substrate
Meas. Tech.
Cathepsin L Enzyme Assay
IC50
2.48e+4±n/a nM
Citation
 Moran, BWAnderson, FPRuth, DMFágáin, CODalton, JPKenny, PT Fluorobenzoyl dipeptidyl derivatives as inhibitors of the Fasciola hepatica cysteine protease cathepsin L1. J Enzyme Inhib Med Chem 25:1-12 (2010)  
Target
Name:
Secreted cathepsin L 1
Synonyms:
Cathepsin L1 (CL1) | Cysteine cathepsin L endoprotease
Type:
Protein
Mol. Mass.:
36773.95
Organism:
Fasciola hepatica (Liver fluke)
Description:
Residue:
326
  
Inhibitor
Name:
BDBM232210
Synonyms:
N-3-fluorobenzoyl-L-leucine-β-alanine benzyl ester (6)
Type:
Small organic molecule
Emp. Form.:
C22H25FN2O4
Mol. Mass.:
400.4433
SMILES:
CC(C)C[C@H](NC(=O)c1cccc(F)c1)C(=O)NCCC(=O)Oc1ccccc1
: