Target
Free fatty acid receptor 1
Ligand
BDBM292024
Substrate
Meas. Tech.
FLIPR Assays
pH
7.4±n/a
Temperature
298.15±n/a K
EC50
306±n/a nM
Comments
extracted
Citation
 Chen, HDeMong, DFinke, PEPlummer, CW [5,6]—fused bicyclic antidiabetic compounds US Patent  US10100042 Publication Date 10/16/2018 
Target
Name:
Free fatty acid receptor 1
Synonyms:
FFAR1 G-protein Coupled Receptor 40 | GPR40
Type:
G Protein-Coupled Receptor (GPCR)
Mol. Mass.:
31473.32
Organism:
Homo sapiens (Human)
Description:
O14842
Residue:
300
  
Inhibitor
Name:
BDBM292024
Synonyms:
US10100042, Example 13
Type:
Small organic molecule
Emp. Form.:
C25H21FO3
Mol. Mass.:
388.4308
SMILES:
Cc1cc(F)cc(C)c1-c1cccc(c1)-c1cc2cc(CCC(O)=O)ccc2o1
: