Target
Peroxisome proliferator-activated receptor alpha
Ligand
BDBM232289
Substrate
Meas. Tech.
Kinase Activity Assay
EC50
5495±n/a nM
Citation
 Wang, YZheng, GSun, PLi, YWu, YLiu, BLiu, XBai, HLi, HZheng, X Compounds having activating effect on subtypes of peroxisome proliferator-activated receptors and its preparation method and uses US Patent  US9346770 Publication Date 5/24/2016 
Target
Name:
Peroxisome proliferator-activated receptor alpha
Synonyms:
NR1C1 PPAR PPAR-alpha PPARA_HUMAN Peroxisome proliferator-activated receptor | Peroxisome proliferator-activated receptor alpha (PPAR alpha)
Type:
Enzyme
Mol. Mass.:
52222.08
Organism:
Homo sapiens (Human)
Description:
Q07869
Residue:
468
  
Inhibitor
Name:
BDBM232289
Synonyms:
US9346770, 2
Type:
Small organic molecule
Emp. Form.:
C23H22F3NO4
Mol. Mass.:
433.4203
SMILES:
CCc1cc(OCCc2coc(n2)-c2ccc(cc2)C(F)(F)F)ccc1CCC(O)=O
: