Target
Peroxisome proliferator-activated receptor alpha
Ligand
BDBM232292
Substrate
Meas. Tech.
Kinase Activity Assay
EC50
1175±n/a nM
Citation
 Wang, YZheng, GSun, PLi, YWu, YLiu, BLiu, XBai, HLi, HZheng, X Compounds having activating effect on subtypes of peroxisome proliferator-activated receptors and its preparation method and uses US Patent  US9346770 Publication Date 5/24/2016 
Target
Name:
Peroxisome proliferator-activated receptor alpha
Synonyms:
NR1C1 PPAR PPAR-alpha PPARA_HUMAN Peroxisome proliferator-activated receptor | Peroxisome proliferator-activated receptor alpha (PPAR alpha)
Type:
Enzyme
Mol. Mass.:
52222.08
Organism:
Homo sapiens (Human)
Description:
Q07869
Residue:
468
  
Inhibitor
Name:
BDBM232292
Synonyms:
US9346770, 5
Type:
Small organic molecule
Emp. Form.:
C24H27NO4
Mol. Mass.:
393.4755
SMILES:
CCc1cc(OCCc2nc(oc2C)-c2ccc(C)cc2)ccc1CCC(O)=O
: