Target
Peroxisome proliferator-activated receptor gamma
Ligand
BDBM232288
Substrate
Meas. Tech.
Kinase Activity Assay
EC50
13±n/a nM
Citation
 Wang, YZheng, GSun, PLi, YWu, YLiu, BLiu, XBai, HLi, HZheng, X Compounds having activating effect on subtypes of peroxisome proliferator-activated receptors and its preparation method and uses US Patent  US9346770 Publication Date 5/24/2016 
Target
Name:
Peroxisome proliferator-activated receptor gamma
Synonyms:
NR1C3 PPAR-gamma PPARG_HUMAN Peroxisome proliferator-activated receptor gamma (PPAR gamma) Peroxisome proliferator-activated receptor gamma (PPARĪ³) peroxisome proliferator-activated receptor gamma isoform 2
Type:
Nuclear Receptor
Mol. Mass.:
57613.46
Organism:
Homo sapiens (Human)
Description:
P37231
Residue:
505
  
Inhibitor
Name:
BDBM232288
Synonyms:
US9346770, 1
Type:
Small organic molecule
Emp. Form.:
C23H24FNO4
Mol. Mass.:
397.4394
SMILES:
CCc1cc(OCCc2nc(oc2C)-c2ccc(F)cc2)ccc1CCC(O)=O
: