Target
Peroxisome proliferator-activated receptor delta
Ligand
BDBM232290
Substrate
Meas. Tech.
Kinase Activity Assay
EC50
<1±n/a nM
Citation
 Wang, YZheng, GSun, PLi, YWu, YLiu, BLiu, XBai, HLi, HZheng, X Compounds having activating effect on subtypes of peroxisome proliferator-activated receptors and its preparation method and uses US Patent  US9346770 Publication Date 5/24/2016 
Target
Name:
Peroxisome proliferator-activated receptor delta
Synonyms:
NR1C2 NUCI Nuclear receptor subfamily 1 group C member 2 PPAR-beta PPARD Peroxisome proliferator-activated receptor Peroxisome proliferator-activated receptor delta
Type:
Enzyme
Mol. Mass.:
49910.45
Organism:
Homo sapiens (Human)
Description:
Q03181
Residue:
441
  
Inhibitor
Name:
BDBM232290
Synonyms:
US9346770, 3
Type:
Small organic molecule
Emp. Form.:
C24H24F3NO4
Mol. Mass.:
447.4469
SMILES:
CCc1cc(OCCc2nc(oc2C)-c2ccc(cc2)C(F)(F)F)ccc1CCC(O)=O
: