Target
Peroxisome proliferator-activated receptor delta
Ligand
BDBM232294
Substrate
Meas. Tech.
Kinase Activity Assay
EC50
3±n/a nM
Citation
 Wang, YZheng, GSun, PLi, YWu, YLiu, BLiu, XBai, HLi, HZheng, X Compounds having activating effect on subtypes of peroxisome proliferator-activated receptors and its preparation method and uses US Patent  US9346770 Publication Date 5/24/2016 
Target
Name:
Peroxisome proliferator-activated receptor delta
Synonyms:
NR1C2 NUCI Nuclear receptor subfamily 1 group C member 2 PPAR-beta PPARD Peroxisome proliferator-activated receptor Peroxisome proliferator-activated receptor delta
Type:
Enzyme
Mol. Mass.:
49910.45
Organism:
Homo sapiens (Human)
Description:
Q03181
Residue:
441
  
Inhibitor
Name:
BDBM232294
Synonyms:
US9346770, 7
Type:
Small organic molecule
Emp. Form.:
C22H23N3O6
Mol. Mass.:
425.4345
SMILES:
CCc1cc(OCCc2nc(oc2C)-c2ccc(cc2)N(=O)=O)ncc1CCC(O)=O
: