Target
Neutrophil elastase
Ligand
BDBM232323
Substrate
US9346794, MeOSuc-Ala-Ala-Pro-Val-AMC
Meas. Tech.
Human Neutrophil Elastase Assay
pH
7.5±n/a
Temperature
298.15±n/a K
IC50
2.5±n/a nM
Comments
extracted
Citation
 Oost, TFiegen, DGnamm, C Substituted 4-pyridones and their use as inhibitors of neutrophil elastase activity US Patent  US9346794 Publication Date 5/24/2016 
Target
Name:
Neutrophil elastase
Synonyms:
Bone marrow serine protease Coagulation factor X ELANE Elastase HLE Leukocyte elastase Medullasin Neutrophil elastase (HNE) PMN elastase Trypsin
Type:
Enzyme
Mol. Mass.:
28532.38
Organism:
Homo sapiens (Human)
Description:
P08246
Residue:
267
  
Inhibitor
Name:
BDBM232323
Synonyms:
US9346794, 27
Type:
Small organic molecule
Emp. Form.:
C28H22F3N5O3S
Mol. Mass.:
565.566
SMILES:
Cc1c(-c2cccc(c2)C(F)(F)F)c(=O)c(cn1-c1ccncc1)C(=O)NCc1ccc(cc1)S(C)(=O)=NC#N
:
Substrate
Name:
BDBM211682
Synonyms:
US9290457, MeOSuc-AAPV-AMC
Type:
Substrate
Emp. Form.:
C31H41N5O9
Mol. Mass.:
627.6853
SMILES:
COC(=O)CCC(=O)NC(C)C(=O)NC(C)C(=O)N1CCCC1C(=O)NC(C(C)C)C(=O)Nc1ccc2c(C)cc(=O)oc2c1
: