Target
Neutrophil elastase
Ligand
BDBM232346
Substrate
US9346794, MeOSuc-Ala-Ala-Pro-Val-AMC
Meas. Tech.
Human Neutrophil Elastase Assay
pH
7.5±n/a
Temperature
298.15±n/a K
IC50
8.6±n/a nM
Comments
extracted
Citation
 Oost, TFiegen, DGnamm, C Substituted 4-pyridones and their use as inhibitors of neutrophil elastase activity US Patent  US9346794 Publication Date 5/24/2016 
Target
Name:
Neutrophil elastase
Synonyms:
Bone marrow serine protease Coagulation factor X ELANE Elastase HLE Leukocyte elastase Medullasin Neutrophil elastase (HNE) PMN elastase Trypsin
Type:
Enzyme
Mol. Mass.:
28532.38
Organism:
Homo sapiens (Human)
Description:
P08246
Residue:
267
  
Inhibitor
Name:
BDBM232346
Synonyms:
US9346794, 50
Type:
Small organic molecule
Emp. Form.:
C27H22F3N5O4S
Mol. Mass.:
569.555
SMILES:
Cc1cc(no1)-n1cc(C(=O)NCc2ccc(cc2)S(C)(=O)=NC#N)c(=O)c(c1C)-c1cccc(c1)C(F)(F)F
:
Substrate
Name:
BDBM211682
Synonyms:
US9290457, MeOSuc-AAPV-AMC
Type:
Substrate
Emp. Form.:
C31H41N5O9
Mol. Mass.:
627.6853
SMILES:
COC(=O)CCC(=O)NC(C)C(=O)NC(C)C(=O)N1CCCC1C(=O)NC(C(C)C)C(=O)Nc1ccc2c(C)cc(=O)oc2c1
: