Target
Tyrosine-protein kinase JAK1
Ligand
BDBM232762
Substrate
Meas. Tech.
JAK Enzyme Assay
pH
7.2±n/a
Temperature
295.15±n/a K
Ki
0.24±n/a nM
Comments
extracted
Citation
 Zak, MERay, NCGoodacre, SCMendonca, RKellar, TCheng, YLi, WYuen, P 5-chloro-2-difluoromethoxyphenyl pyrazolopyrimidine compounds, compositions and methods of use thereof US Patent  US9346815 Publication Date 5/24/2016 
Target
Name:
Tyrosine-protein kinase JAK1
Synonyms:
JAK-1 JAK1A JAK1_HUMAN Janus kinase 1 (JAK1) | Janus kinase 1 JAK1
Type:
Protein
Mol. Mass.:
133293.73
Organism:
Homo sapiens (Human)
Description:
P23458
Residue:
1154
  
Inhibitor
Name:
BDBM232762
Synonyms:
US9346815, 308 | US9604984, Example 308
Type:
Small organic molecule
Emp. Form.:
C24H22ClF2N7O3
Mol. Mass.:
529.926
SMILES:
FC(F)Oc1ccc(Cl)cc1-c1nn(CC(=O)N2CCCCC2)cc1NC(=O)c1cnn2cccnc12
: