Target
Tyrosine-protein kinase JAK1
Ligand
BDBM232888
Substrate
Meas. Tech.
JAK Enzyme Assay
pH
7.2±n/a
Temperature
295.15±n/a K
Ki
0.31±n/a nM
Comments
extracted
Citation
 Zak, MERay, NCGoodacre, SCMendonca, RKellar, TCheng, YLi, WYuen, P 5-chloro-2-difluoromethoxyphenyl pyrazolopyrimidine compounds, compositions and methods of use thereof US Patent  US9346815 Publication Date 5/24/2016 
Target
Name:
Tyrosine-protein kinase JAK1
Synonyms:
JAK-1 JAK1A JAK1_HUMAN Janus kinase 1 (JAK1) | Janus kinase 1 JAK1
Type:
Protein
Mol. Mass.:
133293.73
Organism:
Homo sapiens (Human)
Description:
P23458
Residue:
1154
  
Inhibitor
Name:
BDBM232888
Synonyms:
US9346815, 434 | US9604984, Example 434
Type:
Small organic molecule
Emp. Form.:
C28H29ClF2N8O3S
Mol. Mass.:
631.096
SMILES:
FC(F)Oc1ccc(Cl)cc1-c1nn(CC(=O)N2CCC(CC2)N2CCSCC2)cc1NC(=O)c1cnn2cccnc12
: