Target
Cytochrome P450 11B1, mitochondrial
Ligand
BDBM232946
Substrate
Meas. Tech.
V79-Human-CYP11B2 and V79-Human-CYP11B1 Assays
Temperature
310.15±n/a K
IC50
1072±n/a nM
Comments
extracted
Citation
 Bennett, DJCai, JCarswell, ECooke, AHoyt, SBLondon, CMacLean, JPark, MKRatcliffe, PXiong, YSamanta, SKKulkarni, BA Pyrazolopyridyl compounds as aldosterone synthase inhibitors US Patent  US9351973 Publication Date 5/31/2016 
Target
Name:
Cytochrome P450 11B1, mitochondrial
Synonyms:
C11B1_HUMAN CYPXIB1 Cytochrome P450 11B1 Cytochrome P450 11B1, mitochondrial | S11BH
Type:
Enzyme
Mol. Mass.:
57591.44
Organism:
Homo sapiens (Human)
Description:
P15538
Residue:
503
  
Inhibitor
Name:
BDBM232946
Synonyms:
US9351973, 26 | US9844553, 26
Type:
Small organic molecule
Emp. Form.:
C12H8ClN5O
Mol. Mass.:
273.678
SMILES:
Clc1cncc(c1)-c1nn2CCC(=O)Nc2c1C#N
: