Target
Toll-like receptor 9
Ligand
BDBM232967
Substrate
Meas. Tech.
TLR9 Antagonism Assay
Temperature
310.15±n/a K
IC50
5200±n/a nM
Comments
extracted
Citation
 Lipford, GBZepp, CM Immune system modulators US Patent  US9353115 Publication Date 5/31/2016 
Target
Name:
Toll-like receptor 9
Synonyms:
CD_antigen: CD289 TLR9_HUMAN
Type:
Enzyme
Mol. Mass.:
115889.91
Organism:
Homo sapiens (Human)
Description:
Q9NR96
Residue:
1032
  
Inhibitor
Name:
BDBM232967
Synonyms:
US9353115, 55
Type:
Small organic molecule
Emp. Form.:
C26H36N8O3
Mol. Mass.:
508.6158
SMILES:
CCOC(=O)Cn1cnc2c(NCCN3CCOCC3)nc(nc12)-c1ccc(cc1)N1CCN(C)CC1
: