Target
Epidermal growth factor receptor
Ligand
BDBM139988
Substrate
Meas. Tech.
Cell Proliferation Inhibition Assay
IC50
22±n/a nM
Citation
 Li, XWang, B Pharmaceutical uses of 6-amino quinazoline or 3-cyano quinoline derivatives US Patent  US9358227 Publication Date 6/7/2016 
Target
Name:
Epidermal growth factor receptor
Synonyms:
EGF Receptor Substrate EGFR_HUMAN ERBB1 Epidermal Growth Factor Receptor erbB-1 Epidermal growth factor receptor (EGFR) HER1 Proto-oncogene c-ErbB-1 Tyrosine-Protein Kinase ErbB-1
Type:
Receptor Kinase Domain
Mol. Mass.:
134279.59
Organism:
Homo sapiens (Human)
Description:
P00533
Residue:
1210
  
Inhibitor
Name:
BDBM139988
Synonyms:
US8901140, 1 | US9358227, 1
Type:
Small organic molecule
Emp. Form.:
C32H31ClN6O3
Mol. Mass.:
583.08
SMILES:
CCOc1cc2ncc(C#N)c(Nc3ccc(OCc4ccccn4)c(Cl)c3)c2cc1NC(=O)\C=C\[C@@H]1CCCN1C
: