Target
Lysine-specific histone demethylase 1A
Ligand
BDBM292080
Substrate
Meas. Tech.
n Vitro Enzyme Inhibition Assay LSD-1
Temperature
298.15±n/a K
IC50
<100±n/a nM
Comments
extracted
Citation
 Chen, YKKanouni, TNie, ZStafford, JAVeal, JM Inhibitors of lysine specific demethylase-1 US Patent  US10100046 Publication Date 10/16/2018 
Target
Name:
Lysine-specific histone demethylase 1A
Synonyms:
AOF2 Flavin-containing amine oxidase domain-containing protein 2 KDM1A KIAA0601 Lysine-specific demethylase 1 (LSD1) Lysine-specific histone demethylase 1 (LSD1)
Type:
Enzyme
Mol. Mass.:
92901.01
Organism:
Homo sapiens (Human)
Description:
O60341
Residue:
852
  
Inhibitor
Name:
BDBM292080
Synonyms:
4-{5-[1-(cyclopropylmethyl)-1H-pyrazol-4- yl]-2-{decahydropyrrolo[3,4-d]azepin-6- yl}-1,3-thiazol-4-yl]benzonitrile US9902719, Example 15
Type:
Small organic molecule
Emp. Form.:
C25H28N6S
Mol. Mass.:
444.595
SMILES:
N#Cc1ccc(cc1)-c1nc(sc1-c1cnn(CC2CC2)c1)N1CC[C@@H]2CNC[C@@H]2CC1
: