Target
Lysine-specific histone demethylase 1A
Ligand
BDBM292089
Substrate
Meas. Tech.
n Vitro Enzyme Inhibition Assay LSD-1
Temperature
298.15±n/a K
IC50
<100±n/a nM
Comments
extracted
Citation
 Chen, YKKanouni, TNie, ZStafford, JAVeal, JM Inhibitors of lysine specific demethylase-1 US Patent  US10100046 Publication Date 10/16/2018 
Target
Name:
Lysine-specific histone demethylase 1A
Synonyms:
AOF2 Flavin-containing amine oxidase domain-containing protein 2 KDM1A KIAA0601 Lysine-specific demethylase 1 (LSD1) Lysine-specific histone demethylase 1 (LSD1)
Type:
Enzyme
Mol. Mass.:
92901.01
Organism:
Homo sapiens (Human)
Description:
O60341
Residue:
852
  
Inhibitor
Name:
BDBM292089
Synonyms:
4-[4-(1,2,3,3a,4,6,7,7a- octahydropyrrolo[3,2-c]pyridin-5-yl)-1-(4- cyclopropylphenyl)-6-oxopyrimidin-2-yl]- 2-fluorobenzonitrile US9902719, Example 27
Type:
Small organic molecule
Emp. Form.:
C27H26FN5O
Mol. Mass.:
455.5266
SMILES:
Fc1cc(ccc1C#N)-c1nc(cc(=O)n1-c1ccc(cc1)C1CC1)N1CCC2NCCC2C1
: