Target
Carboxylic ester hydrolase
Ligand
BDBM233116
Substrate
Meas. Tech.
Acetylcholinesterase Inhibition Assay
pH
8±0
Temperature
303.15±0 K
IC50
6.8e+3±n/a nM
Citation
 Zelík, PLukesová, ACejka, JBudesínský, MHavlícek, VCegan, AKopecký, J Nostotrebin 6, a bis(cyclopentenedione) with cholinesterase inhibitory activity isolated from Nostoc sp. str. Lukesová 27/97. J Enzyme Inhib Med Chem 25:414-20 (2010)  
Target
Name:
Carboxylic ester hydrolase
Synonyms:
BuChE Butyrylcholine esterase Butyrylcholinesterase (BChE) Butyrylcholinesterase (EqBuChE) butyrylcholinesterase precursor
Type:
Protein
Mol. Mass.:
68842.83
Organism:
Equus caballus (Horse)
Description:
Q9N1N9
Residue:
602
  
Inhibitor
Name:
BDBM233116
Synonyms:
Nostotrebin 6
Type:
Small organic molecule
Emp. Form.:
C50H38O10
Mol. Mass.:
798.8307
SMILES:
Oc1ccc(CC2=C(Cc3ccc(O)cc3)C(=O)C(C2=O)(c2ccc(O)cc2)C2(C(=O)C(Cc3ccc(O)cc3)=C(Cc3ccc(O)cc3)C2=O)c2ccc(O)cc2)cc1
: