Target
Serine/threonine-protein kinase pim-2
Ligand
BDBM161956
Substrate
Meas. Tech.
PIM-2 Biochemical Assay
IC50
550±n/a nM
Target
Name:
Serine/threonine-protein kinase pim-2
Synonyms:
PIM2 Pim-2h Serine/threonine-protein kinase PIM | Serine/threonine-protein kinase pim-2 (PIM2)
Type:
Serine/threonine-protein kinase
Mol. Mass.:
34185.93
Organism:
Homo sapiens (Human)
Description:
Q9P1W9
Residue:
311
  
Inhibitor
Name:
BDBM161956
Synonyms:
US9682991, 11
Type:
Small organic molecule
Emp. Form.:
C20H21F3N6O2
Mol. Mass.:
434.4149
SMILES:
CCN1CCOc2c1c(NCC1CC1)nn1c(nnc21)-c1cccc(OC(F)(F)F)c1
: