Target
Serine/threonine-protein kinase pim-1
Ligand
BDBM161978
Substrate
Meas. Tech.
PIM-1 Biochemical Assay
IC50
<100±n/a nM
Target
Name:
Serine/threonine-protein kinase pim-1
Synonyms:
PIM-1 Kinase PIM1_HUMAN Serine/threonine-protein kinase (PIM1) Serine/threonine-protein kinase PIM1 | Serine/threonine-protein kinase pim-1 (PIM1)
Type:
Protein
Mol. Mass.:
35681.82
Organism:
Homo sapiens (Human)
Description:
P11309
Residue:
313
  
Inhibitor
Name:
BDBM161978
Synonyms:
US9682991, 27
Type:
Small organic molecule
Emp. Form.:
C22H27F3N8O2
Mol. Mass.:
492.4974
SMILES:
CN1CCN(CCNc2nn3c(nnc3c3OCCN(C)c23)-c2cccc(OC(F)(F)F)c2)CC1
: