Target
Serine/threonine-protein kinase pim-1
Ligand
BDBM162054
Substrate
Meas. Tech.
PIM-1 Biochemical Assay
IC50
550±n/a nM
Target
Name:
Serine/threonine-protein kinase pim-1
Synonyms:
PIM-1 Kinase PIM1_HUMAN Serine/threonine-protein kinase (PIM1) Serine/threonine-protein kinase PIM1 | Serine/threonine-protein kinase pim-1 (PIM1)
Type:
Protein
Mol. Mass.:
35681.82
Organism:
Homo sapiens (Human)
Description:
P11309
Residue:
313
  
Inhibitor
Name:
BDBM162054
Synonyms:
US9682991, 52
Type:
Small organic molecule
Emp. Form.:
C20H25N7O2
Mol. Mass.:
395.4582
SMILES:
COc1cccc(c1)-c1nnc2c3OCCN(C)c3c(NC3CCNCC3)nn12
: