Target
Serine/threonine-protein kinase pim-1
Ligand
BDBM162000
Substrate
Meas. Tech.
PIM-1 Biochemical Assay
IC50
550±n/a nM
Target
Name:
Serine/threonine-protein kinase pim-1
Synonyms:
PIM-1 Kinase PIM1_HUMAN Serine/threonine-protein kinase (PIM1) Serine/threonine-protein kinase PIM1 | Serine/threonine-protein kinase pim-1 (PIM1)
Type:
Protein
Mol. Mass.:
35681.82
Organism:
Homo sapiens (Human)
Description:
P11309
Residue:
313
  
Inhibitor
Name:
BDBM162000
Synonyms:
US9682991, 53
Type:
Small organic molecule
Emp. Form.:
C22H24F3N7O2
Mol. Mass.:
475.4669
SMILES:
CN1CCOc2c(NCC34CCN(CC3)C4)nn3c(nnc3c12)-c1cccc(OC(F)(F)F)c1
: