Target
Serine/threonine-protein kinase pim-1
Ligand
BDBM162009
Substrate
Meas. Tech.
PIM-1 Biochemical Assay
IC50
<100±n/a nM
Target
Name:
Serine/threonine-protein kinase pim-1
Synonyms:
PIM-1 Kinase PIM1_HUMAN Serine/threonine-protein kinase (PIM1) Serine/threonine-protein kinase PIM1 | Serine/threonine-protein kinase pim-1 (PIM1)
Type:
Protein
Mol. Mass.:
35681.82
Organism:
Homo sapiens (Human)
Description:
P11309
Residue:
313
  
Inhibitor
Name:
BDBM162009
Synonyms:
US9682991, 65
Type:
Small organic molecule
Emp. Form.:
C23H26F3N7O2
Mol. Mass.:
489.4934
SMILES:
CN1CCOc2c(NC3CC4(C3)CCNCC4)nn3c(nnc3c12)-c1cccc(OC(F)(F)F)c1
: