Target
Serine/threonine-protein kinase pim-3
Ligand
BDBM162009
Substrate
Meas. Tech.
PIM-3 Biochemical Assay
IC50
550±n/a nM
Target
Name:
Serine/threonine-protein kinase pim-3
Synonyms:
PIM3 Serine/threonine-protein kinase pim-3 (PIM3)
Type:
Protein
Mol. Mass.:
35888.19
Organism:
Homo sapiens (Human)
Description:
Q86V86
Residue:
326
  
Inhibitor
Name:
BDBM162009
Synonyms:
US9682991, 65
Type:
Small organic molecule
Emp. Form.:
C23H26F3N7O2
Mol. Mass.:
489.4934
SMILES:
CN1CCOc2c(NC3CC4(C3)CCNCC4)nn3c(nnc3c12)-c1cccc(OC(F)(F)F)c1
: