Target
Serine/threonine-protein kinase pim-1
Ligand
BDBM162015
Substrate
Meas. Tech.
PIM-1 Biochemical Assay
IC50
<100±n/a nM
Target
Name:
Serine/threonine-protein kinase pim-1
Synonyms:
PIM-1 Kinase PIM1_HUMAN Serine/threonine-protein kinase (PIM1) Serine/threonine-protein kinase PIM1 | Serine/threonine-protein kinase pim-1 (PIM1)
Type:
Protein
Mol. Mass.:
35681.82
Organism:
Homo sapiens (Human)
Description:
P11309
Residue:
313
  
Inhibitor
Name:
BDBM162015
Synonyms:
US9682991, 71
Type:
Small organic molecule
Emp. Form.:
C21H24F3N7O2
Mol. Mass.:
463.4562
SMILES:
CN1CCOc2c1c(N[C@H]1CC[C@H](N)CC1)nn1c(nnc21)-c1cccc(OC(F)(F)F)c1
: