Target
Serine/threonine-protein kinase pim-2
Ligand
BDBM162036
Substrate
Meas. Tech.
PIM-2 Biochemical Assay
IC50
>1000±n/a nM
Target
Name:
Serine/threonine-protein kinase pim-2
Synonyms:
PIM2 Pim-2h Serine/threonine-protein kinase PIM | Serine/threonine-protein kinase pim-2 (PIM2)
Type:
Serine/threonine-protein kinase
Mol. Mass.:
34185.93
Organism:
Homo sapiens (Human)
Description:
Q9P1W9
Residue:
311
  
Inhibitor
Name:
BDBM162036
Synonyms:
US9682991, 92
Type:
Small organic molecule
Emp. Form.:
C23H29N7O3
Mol. Mass.:
451.5215
SMILES:
COc1ccc(cc1)-c1nnc2c3OCCN(C)c3c(nn12)N1CCC(CNC(C)=O)CC1
: