Target
6-phosphogluconate dehydrogenase, decarboxylating
Ligand
BDBM50056998
Substrate
Meas. Tech.
In Vitro Assay
Ki
10100±700 nM
IC50
12000±0.0 nM
Citation
 Akkemik, EBudak, HCiftci, M Effects of some drugs on human erythrocyte 6-phosphogluconate dehydrogenase: an in vitro study. J Enzyme Inhib Med Chem 25:476-9 (2010)  
Target
Name:
6-phosphogluconate dehydrogenase, decarboxylating
Synonyms:
6-phosphogluconate dehydrogenase 6PGD_HUMAN PGDH
Type:
Protein
Mol. Mass.:
53143.42
Organism:
Homo sapiens (Human)
Description:
P52209
Residue:
483
  
Inhibitor
Name:
BDBM50056998
Synonyms:
4-Hydroxy-1,1-dioxo-1,2-dihydro-1lambda*6*-benzo[e][1,2]thiazine-3-carboxylic acid (5-methyl-thiazol-2-yl)-amide CHEMBL599 Meloxicam sodium UH-AC 62XX | UHAC-62XX
Type:
Small organic molecule
Emp. Form.:
C14H13N3O4S2
Mol. Mass.:
351.401
SMILES:
CN1C(C(=O)Nc2ncc(C)s2)=C(O)c2ccccc2S1(=O)=O
: