Target
Polyphenol oxidase 1
Ligand
BDBM233170
Substrate
Meas. Tech.
In Vitro Tyrosinase Inhibition Assay
pH
6.8±n/a
Temperature
298.15±n/a K
IC50
2.09e+3± 6.3e+2 nM
Comments
extracted
Citation
 Khan, SBHassan Khan, MTJang, ESAkhtar, KSeo, JHan, H Tyrosinase inhibitory effect of benzoic acid derivatives and their structure-activity relationships. J Enzyme Inhib Med Chem 25:812-7 (2010)  
Target
Name:
Polyphenol oxidase 1
Synonyms:
PPO1 Polyphenol oxidase | Tyrosinase
Type:
Enzyme
Mol. Mass.:
63902.83
Organism:
Agaricus bisporus (White button mushroom)
Description:
Q00024
Residue:
568
  
Inhibitor
Name:
BDBM233170
Synonyms:
N-Hydroxy-4,N-dimethyl-benzamide (9)
Type:
Small organic molecule
Emp. Form.:
C9H11NO2
Mol. Mass.:
165.1891
SMILES:
CN(O)C(=O)c1ccc(C)cc1
: