Target
Glutathione S-transferase P
Ligand
BDBM4078
Substrate
Meas. Tech.
GST Assay
IC50
5.0e+4±n/a nM
Citation
 Mangoyi, RHayeshi, RNgadjui, BNgandeu, FBezabih, MAbegaz, BRazafimahefa, SRasoanaivo, PMukanganyama, S Glutathione transferase from Plasmodium falciparum--interaction with malagashanine and selected plant natural products. J Enzyme Inhib Med Chem 25:854-62 (2010)  
Target
Name:
Glutathione S-transferase P
Synonyms:
FAEES3 GST3 GSTP1-1 Glutathione S-transferase Glutathione S-transferase P Glutathione transferase (GST)
Type:
Enzyme
Mol. Mass.:
23353.53
Organism:
Homo sapiens (Human)
Description:
P09211
Residue:
210
  
Inhibitor
Name:
BDBM4078
Synonyms:
6,7,13,14-tetrahydroxy-2,9-dioxatetracyclo[6.6.2.0^{4,16}.0^{11,15}]hexadeca-1(14),4(16),5,7,11(15),12-hexaene-3,10-dione ELLAGIC ACID Ellagic acid (18) MLS000069632 cid_5281855
Type:
Small organic molecule
Emp. Form.:
C14H6O8
Mol. Mass.:
302.1926
SMILES:
Oc1cc2c3c(oc(=O)c4cc(O)c(O)c(oc2=O)c34)c1O
: